{"text_format":"1","workbook":"xlsx","n_sheets":13,"sheets":["INFO INICIAL","CUADRO  RESUMEN (0)","Plan de Inversión (1)","Financiación (2)","Simulador préstamos (3) ","Plan de RRHH (4)","Cuadro de Amortización (5)","Líneas de Negocio (6)","Ventas y Costes Variables (7)","Plan de Tesorería (8)"," P y G Previsional (9)","Punto  de equilibrio (10)","Hoja1"],"not_rendered":{"charts":3,"images":4,"macros":1,"external_links":1,"defined_names":52,"comments":6,"pivot_tables":0},"unopened":[],"bounds":{"document_bytes":16777216,"sheet_cells":100000,"rows_first":2000,"rows_last":500,"rows_between":2000,"halvings":0,"cell_chars":16384,"cell_head_chars":4096},"cells_cut":0,"cells_raw":0,"read":"whole","date_system":"1900"}

{"sheet":"INFO INICIAL","index":0,"n_rows":43,"n_cols":11,"rows_kept":43,"cut":false,"hidden":false,"merged":[[21,2,23,2],[39,2,41,2],[33,0,41,0],[30,2,32,2],[1,0,1,1],[3,0,3,1],[8,0,8,2],[9,2,11,2],[12,2,14,2],[15,2,17,2],[18,2,20,2],[24,2,26,2],[27,2,29,2],[9,0,32,0],[33,2,35,2],[36,2,38,2]]}
[]
["NOMBRE DEL PROYECTO:",null,"Macia Batle Winery"]
[]
["MES DE INICIO PREVISTO DE ACTIVIDAD:"]
[]
[null,"FORMA  JURÍDICA PREVISTA:"]
[]
[null,"TIPO DE IMPUESTO A APLICAR:"]
{"$rows_left_out":36}
{"sheet":"CUADRO  RESUMEN (0)","index":1,"n_rows":47,"n_cols":11,"rows_kept":47,"cut":false,"hidden":false,"merged":[[43,7,43,8],[41,7,41,8],[11,0,11,1],[11,9,11,10],[25,0,25,4],[25,7,25,10],[20,9,20,10],[37,0,37,10],[39,0,39,1],[14,0,14,4],[15,0,15,4],[39,7,39,8],[13,9,13,10],[14,9,14,10],[15,9,15,10],[17,9,17,10],[21,9,21,10],[39,3,39,4],[23,9,23,10],[0,0,1,10],[3,0,3,10],[5,0,5,4],[8,0,8,1],[19,9,19,10],[7,0,7,1],[5,7,5,10],[7,9,7,10],[8,9,8,10],[9,9,9,10],[2,0,2,9],[9,0,9,1]]}
["RESUMEN  DEL  PROYECTO"]
[]
[{"$f":"+'INFO INICIAL'!C2","v":"Macia Batle Winery"}]
["Principales datos económicos"]
[]
["Inversión",null,null,null,null,null,null,"Resultados Pérdidas y Ganancias"]
[]
["Inversión en activo NO corriente",null,null,{"$f":"+'Plan de Inversión (1)'!B6","v":5547150},null,null,null,"Ingresos previstos primer año",null,{"$f":"+' P y G Previsional (9)'!$B$5","v":2903150}]
{"$rows_left_out":40}
{"sheet":"Plan de Inversión (1)","index":2,"n_rows":42,"n_cols":12,"rows_kept":42,"cut":false,"hidden":false,"merged":[[40,0,40,11],[41,0,41,11],[1,1,1,11],[3,1,3,3],[3,5,3,7],[3,9,3,11],[2,0,2,1],[38,0,39,11],[37,0,37,11]]}
[]
[{"$f":"+'INFO INICIAL'!C2","v":"Macia Batle Winery"},"PLAN  DE  INVERSIÓN"]
[]
[null,"AÑO 1",null,null,null,"AÑO 2",null,null,null,"AÑO 3"]
["Concepto","Base Impon.","IVA","TOTAL",null,"Base Impon.","IVA","TOTAL",null,"Base Impon.","IVA","TOTAL"]
["ACTIVO  NO  CORRIENTE",{"$f":"(+B7+B15+B25)","v":5547150},{"$f":"(+C7+C15+C25)","v":1164901.5},{"$f":"SUM(B6:C6)","v":6712051.5},null,{"$f":"(+F7+F15+F25)","v":0},{"$f":"(+G7+G15+G25)","v":0},{"$f":"+F6+G6","v":0},null,{"$f":"(+J7+J15+J25)","v":0},{"$f":"(+K7+K15+K25)","v":0},{"$f":"+J6+K6","v":0}]
["Inmovilizado Intangible",{"$f":"SUM(B8:B14)","v":5000},{"$f":"SUM(C8:C14)","v":1050},{"$f":"SUM(B7:C7)","v":6050},null,{"$f":"SUM(F8:F14)","v":0},{"$f":"SUM(G8:G14)","v":0},{"$f":"SUM(F7:G7)","v":0},null,{"$f":"SUM(J8:J14)","v":0},{"$f":"SUM(K8:K14)","v":0},{"$f":"SUM(J7:K7)","v":0}]
["Gastos de constitución",1000,{"$f":"B8*$B$33","v":210},{"$f":"SUM(B8:C8)","v":1210},null,0,{"$f":"F8*$B$33","v":0},{"$f":"SUM(F8:G8)","v":0},null,0,{"$f":"J8*$B$33","v":0},{"$f":"SUM(J8:K8)","v":0}]
{"$rows_left_out":35}
{"sheet":"Financiación (2)","index":3,"n_rows":45,"n_cols":11,"rows_kept":45,"cut":false,"hidden":false,"merged":[[44,0,45,11],[3,1,3,2],[3,4,3,5],[3,7,3,8],[38,0,39,11],[40,0,41,11],[36,0,37,11],[34,0,35,11],[24,0,24,11],[42,0,43,11],[26,10,26,11],[27,10,27,11],[28,10,28,11],[29,10,29,11],[30,10,30,11],[31,10,31,11],[1,1,1,11]]}
[]
[{"$f":"+'INFO INICIAL'!C2","v":"Macia Batle Winery"},"PLAN  DE  FINANCIACIÓN"]
[]
[null,"AÑO 1",null,null,"AÑO 2",null,null,"AÑO 3"]
["FUENTES  DE  FINANCIACIÓN","Importe","Ratios",null,"Importe","Ratios",null,"Importe","Ratios",null,"TOTAL"]
["FONDOS PROPIOS",{"$f":"SUM(B7:B8)","v":4474701},{"$f":"+B6/$B$13","v":0.66666666666666663},null,{"$f":"SUM(E7:E8)","v":0},{"$f":"+E6/$E$13","v":{"$error":"#DIV/0!"}},null,{"$f":"SUM(H7:H8)","v":0},{"$f":"+H6/$H$13","v":{"$error":"#DIV/0!"}},null,{"$f":"SUM(H6+E6+B6)","v":4474701}]
["Capital y otras aportaciones de socios",{"$f":"(2/3)*'Plan de Inversión (1)'!D31","v":4474701},{"$f":"+B7/$B$13","v":0.66666666666666663},null,0,{"$f":"+E7/$E$13","v":{"$error":"#DIV/0!"}},null,0,{"$f":"+H7/$H$13","v":{"$error":"#DIV/0!"}},null,{"$f":"B7+E7+H7","v":4474701}]
["Subvenciones, donaciones y legados",0,{"$f":"+B8/$B$13","v":0},null,0,{"$f":"+E8/$E$13","v":{"$error":"#DIV/0!"}},null,0,{"$f":"+H8/$H$13","v":{"$error":"#DIV/0!"}},null,{"$f":"B8+E8+H8","v":0}]
{"$rows_left_out":38}
{"sheet":"Simulador préstamos (3) ","index":4,"n_rows":520,"n_cols":36,"rows_kept":520,"cut":false,"hidden":false,"merged":[[16,4,16,7],[1,4,1,7],[9,6,9,7],[7,6,7,7],[8,6,8,7],[1,14,1,17],[7,16,7,17],[8,16,8,17],[9,16,9,17],[16,14,16,17]]}
[]
[null,null,null,null,"SIMULADOR DEL PRÉSTAMO ACTIVO NO CORRIENTE",null,null,null,null,null,null,null,null,null,"SIMULADOR DEL PRÉSTAMO ACTIVO CORRIENTE"]
[]
[null,null,null,null,"Capital del crédito",null,null,{"$f":"+'Financiación (2)'!B10","v":2237350.5},null,null,null,null,null,null,"Capital del crédito",null,null,{"$f":"+'Financiación (2)'!B11","v":0}]
[]
[null,null,null,null,"Tipo de interés anual",null,null,0.04,null,null,null,null,null,null,"Tipo de interés anual",null,null,5.5E-2]
[null,null,null,null,"Tipo de interés efectivo",null,null,{"$f":"IF(G9=\"Mensual\",((1+H6)^(1/12))-1,IF(G9=\"Bimensual\",((1+H6)^(1/6))-1,IF(G9=\"Trimestral\",((1+H6)^(1/4))-1,IF(G9=\"Cuatrimestral\",((1+H6)^(1/3))-1,IF(G9=\"Semestral\",((1+H6)^(1/2))-1,IF(G9=\"Anual\",H6))))))","v":3.2737397821989145E-3},null,null,null,null,null,null,"Tipo de interés efectivo",null,null,{"$f":"IF(Q9=\"Mensual\",((1+R6)^(1/12))-1,IF(Q9=\"Bimensual\",((1+R6)^(1/6))-1,IF(Q9=\"Trimestral\",((1+R6)^(1/4))-1,IF(Q9=\"Cuatrimestral\",((1+R6)^(1/3))-1,IF(Q9=\"Semestral\",((1+R6)^(1/2))-1,IF(Q9=\"Anual\",R6))))))","v":4.471698917043021E-3}]
[null,null,null,null,"Duración en años",null,10,null,null,null,null,null,null,null,"Duración en años",null,2]
{"$rows_left_out":513}
{"sheet":"Plan de RRHH (4)","index":5,"n_rows":57,"n_cols":19,"rows_kept":57,"cut":false,"hidden":false,"merged":[[1,1,1,5],[50,0,53,1],[34,1,34,3],[48,2,49,2],[39,0,40,7],[41,0,41,1],[56,0,57,7],[50,2,53,3],[42,7,46,7],[42,4,46,4],[48,0,49,1],[50,7,53,7],[42,6,46,6],[42,0,46,1],[42,5,46,5],[54,0,55,7],[42,2,46,2],[50,4,53,6],[42,3,46,3],[47,0,47,1],[48,3,49,7]]}
[]
[{"$f":"+'INFO INICIAL'!C2","v":"Macia Batle Winery"},"PLAN  DE  RECURSOS  HUMANOS"]
[]
[]
["CATEGORÍA  PROFESIONAL trabajadores cuenta ajena","Número de trabajadores","Sueldo bruto anual","Nº pagas","Sueldo bruto mensual","% Seguridad social","Importe anual seguridad social","Total Coste anual de la empresa"]
["RECEPCIONISTAS",5,16800,12,{"$f":"+(B6*C6)/12","v":7000},0.31640000000000001,{"$f":"C6*F6*B6","v":26577.600000000002},{"$f":"+(B6*C6)+G6","v":110577.60000000001}]
["BOTONES / AYUDANTES RECEPCIÓN",3,14400,12,3600,0.31640000000000001,13668.48,56868.479999999996]
["JEFE DE RECEPCIÓN",1,19200,12,1600,0.31640000000000001,6074.88,25274.880000000001]
{"$rows_left_out":50}
{"sheet":"Cuadro de Amortización (5)","index":6,"n_rows":31,"n_cols":14,"rows_kept":31,"cut":false,"hidden":false,"merged":[[1,1,1,11],[30,0,32,13]]}
[]
[{"$f":"+'INFO INICIAL'!C2","v":"Macia Batle Winery"},"CUADRO  DE  AMORTIZACIÓN"]
[]
[]
[null,"AÑO 1",null,"AÑO 2",null,"AÑO 3",null,"AÑO 1",null,"AÑO 2",null,"AÑO 3"]
["Inmovilizado Intangible","Inversión",null,"Inversión",null,"Inversión",null,"Dotación",null,"Dotación",null,"Dotación","% Dotac.","Años"]
["Gastos de constitución",{"$f":"+'Plan de Inversión (1)'!B8","v":1000},null,{"$f":"+'Plan de Inversión (1)'!F8","v":0},null,{"$f":"+'Plan de Inversión (1)'!J8","v":0},null,{"$f":"+B7*M7","v":200},null,{"$f":"+H7+(D7*M7)","v":200},null,{"$f":"+J7+(F7*M7)","v":200},0.2,{"$f":"100/M7/100","v":5}]
["Gastos de investigación y desarrollo",{"$f":"+'Plan de Inversión (1)'!B9","v":0},null,{"$f":"+'Plan de Inversión (1)'!F9","v":0},null,{"$f":"+'Plan de Inversión (1)'!J9","v":0},null,{"$f":"+B8*M8","v":0},null,{"$f":"+H8+(D8*M8)","v":0},null,{"$f":"+J8+(F8*M8)","v":0},0.2,5]
{"$rows_left_out":24}
{"sheet":"Líneas de Negocio (6)","index":7,"n_rows":36,"n_cols":33,"rows_kept":36,"cut":false,"hidden":false,"merged":[[1,1,1,6],[1,7,1,8],[33,0,34,7],[35,0,36,7],[31,0,32,7],[25,0,25,1],[20,0,20,1],[20,4,20,6],[21,0,21,1],[21,4,21,6],[24,0,24,1]]}
[]
[{"$f":"+'INFO INICIAL'!C2","v":"Macia Batle Winery"},"LINEAS  DE  NEGOCIO / PRODUCTOS"]
[]
[]
["NOMBRE DE LAS LÍNEAS DE NEGOCIO","PRODUCTO/SERVICIO","Tipo de IVA Repercutido","PRECIO VENTA  sin IVA","PRECIO VENTA  CON IVA","Costes directos sin IVA","IVA Soportado","Costes directos con IVA","Margen = Pv - Pc ",null,null,null,null,null,null,null,null,null,null,null,null,null,null,null,null,null,null,null,null,null,null,null,"Producte"]
["HABITACIÓN DBL AD","Servei",0.1,160,{"$f":"+(D6*C6)+D6","v":176},10,0.1,{"$f":"+(F6*G6)+F6","v":11},{"$f":"+(D6-F6)/D6","v":0.9375},null,null,null,null,null,null,null,null,null,null,null,null,null,null,null,null,null,null,null,null,null,null,null,"Servei"]
["JUNIOR SUITE AD","Servei",0.1,250,275,12,0.1,13.2,0.95199999999999996,null,null,null,null,null,null,null,null,null,null,null,null,null,null,null,null,null,null,null,null,null,null,null,0.21]
["SUITE AD","Servei",0.1,350,385,15,0.1,16.5,0.95714285714285718,null,null,null,null,null,null,null,null,null,null,null,null,null,null,null,null,null,null,null,null,null,null,null,0.1]
{"$rows_left_out":29}
{"sheet":"Ventas y Costes Variables (7)","index":8,"n_rows":129,"n_cols":19,"rows_kept":129,"cut":false,"hidden":false,"merged":[[126,0,127,18],[128,0,129,18],[105,0,105,1],[104,0,104,1],[106,0,106,1],[107,0,107,1],[107,4,107,6],[124,0,125,11],[108,4,108,6],[116,0,116,1],[119,0,119,1],[121,0,121,1],[117,0,117,1],[108,0,108,1],[110,0,110,1],[1,1,1,12],[62,1,62,12],[65,0,67,0],[68,0,70,0],[54,0,54,1],[4,0,4,1],[56,0,56,1],[5,0,8,0],[9,0,12,0],[13,0,16,0],[17,0,20,0],[21,0,24,0],[25,0,28,0],[29,0,32,0],[33,0,36,0],[102,0,102,1],[59,4,59,6],[62,14,62,18],[64,0,64,1],[80,0,82,0],[77,0,79,0],[60,4,60,6],[59,0,59,1],[74,0,76,0],[60,0,60,1],[71,0,73,0],[86,0,88,0],[89,0,91,0],[92,0,94,0],[95,0,97,0],[98,0,100,0],[37,0,40,0],[41,0,44,0],[45,0,48,0],[49,0,52,0],[83,0,85,0],[58,0,58,1]]}
[]
[{"$f":"+'INFO INICIAL'!C2","v":"Macia Batle Winery"},"PRESUPUESTO  DE  VENTAS"]
[]
[null,null,null,null,null,null,null,null,null,null,null,null,null,null,null,null,1,"Enero"]
["VENDES",null,{"$f":"LOOKUP(IF(($Q$19+1)<13,$Q$19+1,$Q$19+1-12),$Q$4:$R$16)","v":"Enero"},"Febrero",{"$f":"LOOKUP(IF(($Q$19+3)<13,$Q$19+3,$Q$19+3-12),$Q$4:$R$16)","v":"Marzo"},{"$f":"LOOKUP(IF(($Q$19+4)<13,$Q$19+4,$Q$19+4-12),$Q$4:$R$16)","v":"Abril"},{"$f":"LOOKUP(IF(($Q$19+5)<13,$Q$19+5,$Q$19+5-12),$Q$4:$R$16)","v":"Mayo"},{"$f":"LOOKUP(IF(($Q$19+6)<13,$Q$19+6,$Q$19+6-12),$Q$4:$R$16)","v":"Junio"},{"$f":"LOOKUP(IF(($Q$19+7)<13,$Q$19+7,$Q$19+7-12),$Q$4:$R$16)","v":"Julio"},{"$f":"LOOKUP(IF(($Q$19+8)<13,$Q$19+8,$Q$19+8-12),$Q$4:$R$16)","v":"Agosto"},{"$f":"LOOKUP(IF(($Q$19+9)<13,$Q$19+9,$Q$19+9-12),$Q$4:$R$16)","v":"Septiembre"},{"$f":"LOOKUP(IF(($Q$19+10)<13,$Q$19+10,$Q$19+10-12),$Q$4:$R$16)","v":"Octubre"},{"$f":"LOOKUP(IF(($Q$19+11)<13,$Q$19+11,$Q$19+11-12),$Q$4:$R$16)","v":"Noviembre"},{"$f":"LOOKUP(IF(($Q$19+12)<13,$Q$19+12,$Q$19+12-12),$Q$4:$R$16)","v":"Diciembre"},"AÑO 1","AÑO 2",3,"Marzo","AÑO 3"]
[{"$f":"+'Líneas de Negocio (6)'!A6","v":"HABITACIÓN DBL AD"},"Nº unidades producto o servicio (A)",600,560,620,600,620,600,620,620,600,620,600,620,{"$f":"SUM(C6:N6)","v":7280},{"$f":"O6+(O6*$C$60)","v":7280},4,"Abril",{"$f":"O6+(O6*$C$61)","v":7280}]
[null,"Precio Venta Unitario",{"$f":"+'Líneas de Negocio (6)'!D6","v":160},{"$f":"+'Líneas de Negocio (6)'!D6","v":160},{"$f":"+'Líneas de Negocio (6)'!D6","v":160},{"$f":"+'Líneas de Negocio (6)'!D6","v":160},{"$f":"+'Líneas de Negocio (6)'!D6","v":160},{"$f":"+'Líneas de Negocio (6)'!D6","v":160},{"$f":"+'Líneas de Negocio (6)'!D6","v":160},{"$f":"+'Líneas de Negocio (6)'!D6","v":160},{"$f":"+'Líneas de Negocio (6)'!D6","v":160},{"$f":"+'Líneas de Negocio (6)'!D6","v":160},{"$f":"+'Líneas de Negocio (6)'!D6","v":160},{"$f":"+'Líneas de Negocio (6)'!D6","v":160},{"$f":"C7","v":160},{"$f":"O7+(O7*$H$60)","v":161.91999999999999},5,"Mayo",{"$f":"P7+(P7*$H$61)","v":167.42527999999999}]
[null,"Ingresos producto o servicio (A)",{"$f":"+C6*C7","v":96000},{"$f":"+D6*D7","v":89600},99200,96000,99200,96000,99200,99200,96000,99200,96000,99200,{"$f":"SUM(C8:N8)","v":1164800},{"$f":"+P6*P7","v":1178777.5999999999},6,"Junio",{"$f":"+S6*S7","v":1218856.0384}]
{"$rows_left_out":122}
{"sheet":"Plan de Tesorería (8)","index":9,"n_rows":97,"n_cols":66,"rows_kept":97,"cut":false,"hidden":false,"merged":[[62,1,62,2],[61,1,61,2],[1,1,1,12],[2,1,2,2],[65,1,65,17]]}
[]
[{"$f":"+'INFO INICIAL'!C2","v":"Macia Batle Winery"},"PLAN  DE  TESORERÍA - Año 1"]
["Mes previsto de inicio de las actividades:",{"$f":"CHOOSE(D3,'INFO INICIAL'!$F$28,'INFO INICIAL'!$F$29,'INFO INICIAL'!$F$30,'INFO INICIAL'!$F$31,'INFO INICIAL'!$F$32,'INFO INICIAL'!$F$33,'INFO INICIAL'!$F$34,'INFO INICIAL'!$F$35,'INFO INICIAL'!$F$36,'INFO INICIAL'!$F$37,'INFO INICIAL'!$F$38,'INFO INICIAL'!$F$39)","v":"Abril"},null,4,null,null,null,null,null,null,null,null,null,null,null,null,null,null,null,null,null,null,null,null,null,null,{"$f":"IF(T('CUADRO  RESUMEN (0)'!J40)='INFO INICIAL'!H29,0,1)","v":1},{"$f":"IF(T('CUADRO  RESUMEN (0)'!J40)='INFO INICIAL'!H29,1,0)","v":0}]
[null,null,null,null,null,null,null,null,null,null,null,null,null,null,null,null,null,null,null,null,null,null,null,null,null,null,{"$f":"IF(T('CUADRO  RESUMEN (0)'!J40)='INFO INICIAL'!H31,0,1)","v":1},{"$f":"IF(T('CUADRO  RESUMEN (0)'!J40)='INFO INICIAL'!H31,1,0)","v":0}]
["COBROS","Enero","Febrero","Marzo","Abril","Mayo","Junio","Julio","Agosto"," Septiembre","Octubre","Noviembre","Diciembre","AÑO 1 ",null,"AÑO 2",null,"AÑO 3",null,null,null,null,null,null,null,null,{"$f":"AA3*AA4","v":1},{"$f":"AB3+AB4","v":0},null,null,1,2,3,4,5,6,7,8,9,10,11,12,13,14,15,16,17,18,19,20,21,22,23,24,25,26,27,28,29,30,31,32,33,34,35,36]
[{"$f":"+'Líneas de Negocio (6)'!A6","v":"HABITACIÓN DBL AD"},{"$f":"IF($AA$21<AE$5,+'Ventas y Costes Variables (7)'!C8,0)","v":0},{"$f":"IF($AA$21<AF$5,+'Ventas y Costes Variables (7)'!D8,0)","v":0},{"$f":"IF($AA$21<AG$5,+'Ventas y Costes Variables (7)'!E8,0)","v":0},{"$f":"IF($AA$21<AH$5,+'Ventas y Costes Variables (7)'!F8,0)","v":96000},{"$f":"IF($AA$21<AI$5,+'Ventas y Costes Variables (7)'!G8,0)","v":99200},{"$f":"IF($AA$21<AJ$5,+'Ventas y Costes Variables (7)'!H8,0)","v":96000},{"$f":"IF($AA$21<AK$5,+'Ventas y Costes Variables (7)'!I8,0)","v":99200},{"$f":"IF($AA$21<AL$5,+'Ventas y Costes Variables (7)'!J8,0)","v":99200},{"$f":"IF($AA$21<AM$5,+'Ventas y Costes Variables (7)'!K8,0)","v":96000},{"$f":"IF($AA$21<AN$5,+'Ventas y Costes Variables (7)'!L8,0)","v":99200},{"$f":"IF($AA$21<AO$5,+'Ventas y Costes Variables (7)'!M8,0)","v":96000},{"$f":"IF($AA$21<AP$5,+'Ventas y Costes Variables (7)'!N8,0)","v":99200},{"$f":"SUM(B6:M6)","v":880000},null,{"$f":"+'Ventas y Costes Variables (7)'!P8","v":1178777.5999999999},null,{"$f":"+'Ventas y Costes Variables (7)'!S8","v":1218856.0384},null,null,null,null,null,null,0,"Enero",{"$f":"IF(B$3=Z6,Y6,0)","v":0},null,null,1,{"$f":"'Simulador préstamos (3) '!$E23+'Simulador préstamos (3) '!$O23","v":7324.5033385726329},0,0,0,0,0,0,0,0,0,0,0,0,0,0,0,0,0,0,0,0,0,0,0,0,0,0,0,0,0,0,0,0,0,0,0]
[{"$f":"+'Líneas de Negocio (6)'!A7","v":"JUNIOR SUITE AD"},{"$f":"IF($AA$21<AE$5,+'Ventas y Costes Variables (7)'!C12,0)","v":0},{"$f":"IF($AA$21<AF$5,+'Ventas y Costes Variables (7)'!D12,0)","v":0},{"$f":"IF($AA$21<AG$5,+'Ventas y Costes Variables (7)'!E12,0)","v":0},{"$f":"IF($AA$21<AH$5,+'Ventas y Costes Variables (7)'!F12,0)","v":22500},{"$f":"IF($AA$21<AI$5,+'Ventas y Costes Variables (7)'!G12,0)","v":23250},{"$f":"IF($AA$21<AJ$5,+'Ventas y Costes Variables (7)'!H12,0)","v":22500},{"$f":"IF($AA$21<AK$5,+'Ventas y Costes Variables (7)'!I12,0)","v":23250},{"$f":"IF($AA$21<AL$5,+'Ventas y Costes Variables (7)'!J12,0)","v":23250},{"$f":"IF($AA$21<AM$5,+'Ventas y Costes Variables (7)'!K12,0)","v":22500},{"$f":"IF($AA$21<AN$5,+'Ventas y Costes Variables (7)'!L12,0)","v":23250},{"$f":"IF($AA$21<AO$5,+'Ventas y Costes Variables (7)'!M12,0)","v":22500},{"$f":"IF($AA$21<AP$5,+'Ventas y Costes Variables (7)'!N12,0)","v":23250},{"$f":"SUM(B7:M7)","v":206250},null,{"$f":"+'Ventas y Costes Variables (7)'!P12","v":276276},null,{"$f":"+'Ventas y Costes Variables (7)'!S12","v":285669.38399999996},null,null,null,null,null,null,1,"Febrero",{"$f":"IF(B$3=Z7,Y7,0)","v":0},null,null,2,{"$f":"'Simulador préstamos (3) '!$E24+'Simulador préstamos (3) '!$O24","v":7324.5033385726329},{"$f":"AE6","v":7324.5033385726329},0,0,0,0,0,0,0,0,0,0,0,0,0,0,0,0,0,0,0,0,0,0,0,0,0,0,0,0,0,0,0,0,0,0]
[{"$f":"+'Líneas de Negocio (6)'!A8","v":"SUITE AD"},{"$f":"IF($AA$21<AE$5,+'Ventas y Costes Variables (7)'!C16,0)","v":0},{"$f":"IF($AA$21<AF$5,+'Ventas y Costes Variables (7)'!D16,0)","v":0},{"$f":"IF($AA$21<AG$5,+'Ventas y Costes Variables (7)'!E16,0)","v":0},{"$f":"IF($AA$21<AH$5,+'Ventas y Costes Variables (7)'!F16,0)","v":21000},{"$f":"IF($AA$21<AI$5,+'Ventas y Costes Variables (7)'!G16,0)","v":21700},{"$f":"IF($AA$21<AJ$5,+'Ventas y Costes Variables (7)'!H16,0)","v":21000},{"$f":"IF($AA$21<AK$5,+'Ventas y Costes Variables (7)'!I16,0)","v":21700},{"$f":"IF($AA$21<AL$5,+'Ventas y Costes Variables (7)'!J16,0)","v":21700},{"$f":"IF($AA$21<AM$5,+'Ventas y Costes Variables (7)'!K16,0)","v":21000},{"$f":"IF($AA$21<AN$5,+'Ventas y Costes Variables (7)'!L16,0)","v":21700},{"$f":"IF($AA$21<AO$5,+'Ventas y Costes Variables (7)'!M16,0)","v":21000},{"$f":"IF($AA$21<AP$5,+'Ventas y Costes Variables (7)'!N16,0)","v":21700},192500,null,{"$f":"+'Ventas y Costes Variables (7)'!P16","v":257857.6},null,{"$f":"+'Ventas y Costes Variables (7)'!S16","v":266624.75839999999},null,null,null,null,null,null,2,"Marzo",0,null,null,3,{"$f":"'Simulador préstamos (3) '!$E25+'Simulador préstamos (3) '!$O25","v":7324.5033385726329},{"$f":"AE7","v":7324.5033385726329},{"$f":"AE6","v":7324.5033385726329},0,0,0,0,0,0,0,0,0,0,0,0,0,0,0,0,0,0,0,0,0,0,0,0,0,0,0,0,0,0,0,0,0]
{"$rows_left_out":90}
{"sheet":" P y G Previsional (9)","index":10,"n_rows":62,"n_cols":12,"rows_kept":62,"cut":false,"hidden":false,"merged":[[1,1,1,6]]}
[]
[{"$f":"+'INFO INICIAL'!C2","v":"Macia Batle Winery"},"CUENTA  DE  RESULTADOS  PREVISIONAL"]
[]
[null,{"$f":"'Cuadro de Amortización (5)'!B5","v":"AÑO 1"},"%",{"$f":"'Cuadro de Amortización (5)'!D5","v":"AÑO 2"},"%",{"$f":"'Cuadro de Amortización (5)'!L5","v":"AÑO 3"},"%"]
["INGRESOS  ",{"$f":"SUM(B6:B14)","v":2903150},null,{"$f":"SUM(D6:D14)","v":3916341.12},null,{"$f":"SUM(F6:F14)","v":4039582.3180800006}]
[{"$f":"+'Plan de Tesorería (8)'!A6","v":"HABITACIÓN DBL AD"},{"$f":"+'Plan de Tesorería (8)'!N6","v":880000},null,{"$f":"+'Plan de Tesorería (8)'!P6","v":1178777.5999999999},null,{"$f":"+'Plan de Tesorería (8)'!R6","v":1218856.0384}]
[{"$f":"+'Plan de Tesorería (8)'!A7","v":"JUNIOR SUITE AD"},{"$f":"+'Plan de Tesorería (8)'!N7","v":206250},null,{"$f":"+'Plan de Tesorería (8)'!P7","v":276276},null,{"$f":"+'Plan de Tesorería (8)'!R7","v":285669.38399999996}]
[{"$f":"+'Plan de Tesorería (8)'!A8","v":"SUITE AD"},{"$f":"+'Plan de Tesorería (8)'!N8","v":192500},null,{"$f":"+'Plan de Tesorería (8)'!P8","v":257857.6},null,{"$f":"+'Plan de Tesorería (8)'!R8","v":266624.75839999999}]
{"$rows_left_out":55}
{"sheet":"Punto  de equilibrio (10)","index":11,"n_rows":17,"n_cols":6,"rows_kept":17,"cut":false,"hidden":false,"merged":[[1,1,1,6],[14,0,15,5],[16,0,16,5]]}
[]
[{"$f":"+'INFO INICIAL'!C2","v":"Macia Batle Winery"},"PUNTO  DE  EQUILIBRIO"]
[]
[]
[null,"Año 1",null,"Año 2",null,"Año 3"]
["Ingresos de explotación",{"$f":"' P y G Previsional (9)'!B6+' P y G Previsional (9)'!B7+' P y G Previsional (9)'!B8+' P y G Previsional (9)'!B9+' P y G Previsional (9)'!B10+' P y G Previsional (9)'!B11","v":2901250},null,{"$f":"' P y G Previsional (9)'!D6+' P y G Previsional (9)'!D7+' P y G Previsional (9)'!D8+' P y G Previsional (9)'!D9+' P y G Previsional (9)'!D10+' P y G Previsional (9)'!D11","v":3624741.12},null,{"$f":"' P y G Previsional (9)'!F6+' P y G Previsional (9)'!F7+' P y G Previsional (9)'!F8+' P y G Previsional (9)'!F9+' P y G Previsional (9)'!F10+' P y G Previsional (9)'!F11","v":3747982.3180800006}]
["Costes Variables",{"$f":"' P y G Previsional (9)'!B16","v":214800},null,{"$f":"' P y G Previsional (9)'!D16","v":284448},null,{"$f":"' P y G Previsional (9)'!F16","v":284448}]
["Costes Fijos - Gastos amortización",{"$f":"+' P y G Previsional (9)'!B28-' P y G Previsional (9)'!B43-$B$9","v":955333.87643143581},null,{"$f":"+' P y G Previsional (9)'!D28-' P y G Previsional (9)'!D43-$B$9","v":1013004.4617859919},null,{"$f":"+' P y G Previsional (9)'!F28-' P y G Previsional (9)'!F43-$B$9","v":1016594.1204262241}]
{"$rows_left_out":10}
{"sheet":"Hoja1","index":12,"n_rows":0,"n_cols":0,"rows_kept":0,"cut":false,"hidden":false,"merged":[]}